Compilation errors on CentOS - pjsip-2.12

[Date Prev][Date Next][Thread Prev][Thread Next][Date Index][Thread Index]


Hi Team,


I am seeing compilation errors while building pjsip-2.12 from scratch as below. Could you please check and let me know how to solve the same.


/root/pjproject-2.12/third_party/build/srtp/../../srtp/crypto/math/datatypes.c:161:(.text+0x198): additional relocation overflows omitted from the output collect2: error: ld returned 1 exit status

gmake[2]: *** [../bin/pjsua2-test-x86_64-unknown-linux-gnu] Error 1

gmake[2]: Leaving directory `/root/pjproject-2.12/pjsip/build'

gmake[1]: *** [pjsua2-test-x86_64-unknown-linux-gnu] Error 2

gmake[1]: Leaving directory `/root/pjproject-2.12/pjsip/build'

gmake: *** [all] Error 1




NOTE: This e-mail (including any attachments) is for the sole use of the intended recipient(s) and may contain information that is confidential and/or protected by legal privilege. Any unauthorized review, use, copy, disclosure or distribution of this e-mail is strictly prohibited. If you are not the intended recipient, please notify Mitel immediately and destroy all copies of this e-mail. Mitel does not accept any liability for breach of security, error or virus that may result from the transmission of this message.

Visit our blog:

pjsip mailing list -- pjsip@xxxxxxxxxxxxxxx
To unsubscribe send an email to pjsip-leave@xxxxxxxxxxxxxxx

[Index of Archives]     [Asterisk Users]     [Asterisk App Development]     [Linux ARM Kernel]     [Linux ARM]     [Linux Omap]     [Fedora ARM]     [IETF Annouce]     [Security]     [Bugtraq]     [Linux]     [Linux OMAP]     [Linux MIPS]     [Linux API]
  Powered by Linux