Hi, I have been trying to compile kernel-2.5.62 applied patch-2.5.62-ac1, but keep getting these errors: n file included from drivers/char/riscom8.c:51: drivers/char/riscom8.h:88: field `tqueue' has incomplete type drivers/char/riscom8.h:89: field `tqueue_hangup' has incomplete type drivers/char/riscom8.c:84: warning: type defaults to `int' in declaration of `DEC LARE_TASK_QUEUE' drivers/char/riscom8.c:84: warning: parameter names (without types) in function d eclaration drivers/char/riscom8.c:142: confused by earlier errors, bailing out make[2]: *** [drivers/char/riscom8.o] Error 1 make[1]: *** [drivers/char] Error 2 make: *** [drivers] Error 2 I`using rh phoebe with the latest rawhide packages, kernel-2.4.20-2.50, gcc-3.2.2-2 glibc-2.3.1-46 Has anybody encountered these errors? Is it a bug? checked bugzilla.kernel.org but I couldn`t find any thing.. Thanks, alvaro -- Kernelnewbies: Help each other learn about the Linux kernel. Archive: http://mail.nl.linux.org/kernelnewbies/ FAQ: http://kernelnewbies.org/faq/