Hello,
Finally I could compile h323plus. However, when I try to compile GNUGK, now I’m obtaining these errors:
[CC] GkClient.cxx GkClient.cxx: In member function �uro;˜bool GkClient::WaitForACF(H225_AdmissionRequest&, RasRequester&, Routing::RoutingRequest*)�uro;™: GkClient.cxx:2601: error: variable �uro;˜H460_FeatureSet fs�uro;™ has initializer but incomplete type GkClient.cxx:2601: error: invalid use of incomplete type �uro;˜struct H460_FeatureSet�uro;™ /usr/local/include/openh323/h323con.h:182: error: forward declaration of �uro;˜struct H460_FeatureSet�uro;™ GkClient.cxx:2606: error: variable �uro;˜H460_FeatureSet arq_fs�uro;™ has initializer but incomplete type GkClient.cxx:2606: error: invalid use of incomplete type �uro;˜struct H460_FeatureSet�uro;™ /usr/local/include/openh323/h323con.h:182: error: forward declaration of �uro;˜struct H460_FeatureSet�uro;™ GkClient.cxx:2608: error: �uro;˜H460_FeatureStd�uro;™ was not declared in this scope GkClient.cxx:2608: error: �uro;˜arq_h46022�uro;™ was not declared in this scope GkClient.cxx:2608: error: expected primary-_expression_ before �uro;˜)�uro;™ token GkClient.cxx:2608: error: expected �uro;˜;�uro;™ before �uro;˜arq_fs�uro;™ GkClient.cxx:2609: error: �uro;˜acf_h46022�uro;™ was not declared in this scope GkClient.cxx:2609: error: expected primary-_expression_ before �uro;˜)�uro;™ token GkClient.cxx:2609: error: expected �uro;˜;�uro;™ before �uro;˜fs�uro;™ GkClient.cxx:2612: error: �uro;˜H460_FeatureParameter�uro;™ was not declared in this scope GkClient.cxx:2612: error: �uro;˜tlsparam�uro;™ was not declared in this scope GkClient.cxx:2613: error: expected �uro;˜;�uro;™ before �uro;˜settings�uro;™ GkClient.cxx:2614: error: �uro;˜settings�uro;™ was not declared in this scope make[1]: *** [obj_linux_x86_64_s/GkClient.o] Error 1 make[1]: Leaving directory `/usr/src/gnugk-3.5' make: *** [optnoshared] Error 2
Perhaps I did something wrong with h323plus :S
Regards, Juan Pablo. |
------------------------------------------------------------------------------ Put Bad Developers to Shame Dominate Development with Jenkins Continuous Integration Continuously Automate Build, Test & Deployment Start a new project now. Try Jenkins in the cloud. http://p.sf.net/sfu/13600_Cloudbees
_______________________________________________________ Posting: mailto:Openh323gk-users@xxxxxxxxxxxxxxxxxxxxx Archive: http://sourceforge.net/mailarchive/forum.php?forum_name=openh323gk-users Unsubscribe: http://lists.sourceforge.net/lists/listinfo/openh323gk-users Homepage: http://www.gnugk.org/