Re: EXTERNAL: Re: GCC 4.1.1 Solaris 10 installation

[Date Prev][Date Next][Thread Prev][Thread Next][Date Index][Thread Index]

 



On 25 May 2016 at 16:48, Joseph, Matthew wrote:
> Hey Tim,
>
> Was able to make it past the libiberty issue. I ended up downloading another tar of GCC.
> Now it does a partial fail when I do a gmake install.
> Here is the error I'm getting;
>
> Gmake[4] *** [install-headers] error 1
> Gmake[4] leaving directory '/tmp/gcc-4.1.1/objsrc/build-sparc-sun-solaris2.10/libstdc++-V3/include'
> Gmake[3] *** [install-am] Error 2
> Gmake[3] leaving directory '/tmp/gcc-4.1.1/objsrc/build-sparc-sun-solaris2.10/libstdc++-V3/include'
> Gmake[2] *** [install-recursive] error 1
> Gmake[2] leaving directory '/tmp/gcc-4.1.1/objsrc/build-sparc-sun-solaris2.10/libstdc++-V3
> Gmake[1]  *** [install-target-libstdc+++-V3] Error 2
> Gmake[1]   leaving directory '/tmp/gcc-4.1.1/objsrc/
> Gmake: *** [install] Error 2

You're not showing the errors, just the fallout that comes after the
error, so there's no way to know what's happening.



[Index of Archives]     [Linux C Programming]     [Linux Kernel]     [eCos]     [Fedora Development]     [Fedora Announce]     [Autoconf]     [The DWARVES Debugging Tools]     [Yosemite Campsites]     [Yosemite News]     [Linux GCC]

  Powered by Linux